Target
Serine/threonine-protein kinase Chk1
Ligand
BDBM466921
Substrate
Meas. Tech.
pCHK1 Cellular Assay
IC50
51.0±n/a nM
Citation
 Di Francesco, MEJones, PCarroll, CLCross, JBKang, ZJohnson, MGLively, S Heterocyclic inhibitors of ATR kinase US Patent  US10800774 Publication Date 10/13/2020 
Target
Name:
Serine/threonine-protein kinase Chk1
Synonyms:
CHEK1 CHK1 checkpoint homolog Checkpoint kinase-1 (CHK1)
Type:
Enzyme Catalytic Domain
Mol. Mass.:
54443.02
Organism:
Homo sapiens (Human)
Description:
gi_166295192
Residue:
476
  
Inhibitor
Name:
BDBM466921
Synonyms:
1-(4-{6-[(3R)-3- Methylmorpholin-4-yl]-2- {1H-pyrrolo[2,3-b]pyridin-4- yl}pyrimidin-4-yl}piperidin- 1-yl) propan-1-one | US10800774, Example 20
Type:
Small organic molecule
Emp. Form.:
C24H30N6O2
Mol. Mass.:
434.534
SMILES:
CCC(=O)N1CCC(CC1)c1cc(nc(n1)-c1ccnc2[nH]ccc12)N1CCOC[C@H]1C
: