Target
ATR-interacting protein/Serine/threonine-protein kinase ATR
Ligand
BDBM466922
Substrate
Meas. Tech.
ATR/ATRIP Enzymatic Assay
IC50
22.0±n/a nM
Citation
 Di Francesco, MEJones, PCarroll, CLCross, JBKang, ZJohnson, MGLively, S Heterocyclic inhibitors of ATR kinase US Patent  US10800774 Publication Date 10/13/2020 
Target
Name:
ATR-interacting protein/Serine/threonine-protein kinase ATR
Synonyms:
ATR/ATRIP
Type:
Enzyme
Mol. Mass.:
Description:
Components:
This complex has 2 components.
Component 1
Name:
Serine/threonine-protein kinase ATR
Synonyms:
ATR Ataxia telangiectasia and Rad3-related protein (ATR) FRP1 | Serine-protein kinase ATR
Type:
Protein
Mol. Mass.:
301404.58
Organism:
Homo sapiens (Human)
Description:
Q13535
Residue:
2644
  
Component 2
Name:
ATR-interacting protein
Synonyms:
AGS1 ATR-interacting protein (ATRIP) ATRIP_HUMAN
Type:
Enzyme Catalytic Domain
Mol. Mass.:
85833.30
Organism:
Homo sapiens (Human)
Description:
Q8WXE1
Residue:
791
  
Inhibitor
Name:
BDBM466922
Synonyms:
(3R)-4-[6-(1- Cyclopropanecarbonylpiperidin- 4-yl)-2-{1H-pyrrolo[2,3- b]pyridin-4-yl}pyrimidin-4- yl]-3-methylmorpholine | US10800774, Example 21
Type:
Small organic molecule
Emp. Form.:
C25H30N6O2
Mol. Mass.:
446.5447
SMILES:
C[C@@H]1COCCN1c1cc(nc(n1)-c1ccnc2[nH]ccc12)C1CCN(CC1)C(=O)C1CC1
: