Target
Tyrosine-protein kinase JAK3 [781-1124]
Ligand
BDBM466938
Substrate
IC50
55±n/a nM
Citation
 Anderson, DRHockerman, SLBlinn, JRJacobsen, EJ Pyrazolyl pyrrolo[2,3-b]pyrmidine-5-carboxylate analogs and methods of making the same US Patent  US10800775 Publication Date 10/13/2020 
Target
Name:
Tyrosine-protein kinase JAK3 [781-1124]
Synonyms:
JAK3 JAK3_HUMAN Tyrosine-protein kinase JAK3 Tyrosine-protein kinase JAK3 (aa 781-1124)
Type:
Mol. Mass.:
38772.27
Organism:
Homo sapiens (Human)
Description:
P52333[781-1124]
Residue:
344
  
Inhibitor
Name:
BDBM466938
Synonyms:
US10800775, Example 18 | isopropyl 4-(1-(2-cyano-1-cyclopentylethyl)-1H-pyrazol-4-yl)- 1H-pyrrolo[2,3-b]pyridine-5-carboxylate, enantiomer 1 single enantiomer, absolute configuration not known
Type:
Small organic molecule
Emp. Form.:
C22H25N5O2
Mol. Mass.:
391.4662
SMILES:
CC(C)OC(=O)c1cnc2[nH]ccc2c1-c1cnn(c1)[C@H](CC#N)C1CCCC1
: