Target
Metabotropic glutamate receptor 2
Ligand
BDBM466960
Substrate
Meas. Tech.
In Vitro Activity Test for mGluR2
EC50
62.3±n/a nM
Citation
 Liu, HZhou, YXia, WZhang, DJiang, HChen, K Fluorine-containing triazolopyridine, and manufacturing method, pharmaceutical composition, and application thereof US Patent  US10800776 Publication Date 10/13/2020 
Target
Name:
Metabotropic glutamate receptor 2
Synonyms:
GPRC1B GRM2_HUMAN Metabotropic glutamate receptor mGlu2 | metabotropic glutamate 2
Type:
Enzyme
Mol. Mass.:
95584.88
Organism:
Homo sapiens (Human)
Description:
Q14416
Residue:
872
  
Inhibitor
Name:
BDBM466960
Synonyms:
7-(Benzo[d][1,3]dioxol-5-yl)-8-chloro- 3-((2,2-difluorocyclopropyl) methyl)-[1, 2,4]triazole [4,3-a]pyridine | US10800776, Example 50
Type:
Small organic molecule
Emp. Form.:
C17H12ClF2N3O2
Mol. Mass.:
363.746
SMILES:
FC1(F)CC1Cc1nnc2c(Cl)c(ccn12)-c1ccc2OCOc2c1
: