Target
Beta-lactamase TEM
Ligand
BDBM466964
Substrate
Meas. Tech.
Inhibition of Beta-Lactamase Enzymes
IC50
19.0±n/a nM
Citation
 Comita-Prevoir, JDurand-Reville, TFGauthier, LO''Donnell, JRomero, JTommasi, RVerheijen, JCWu, FWu, XZhang, J Beta-lactamase inhibitor compounds US Patent  US10800778 Publication Date 10/13/2020 
Target
Name:
Beta-lactamase TEM
Synonyms:
BLAT_ECOLX Beta-lactamase (TEM-1) Beta-lactamase TEM-1 Beta-lactamase TEM1D Beta-lactamase TEM1F TEM extended-spectrum beta-lactamase bla
Type:
Enzyme
Mol. Mass.:
31512.33
Organism:
Escherichia coli
Description:
P62593
Residue:
286
  
Inhibitor
Name:
BDBM466964
Synonyms:
(2S)-{[(2S,5R)-2-carbamoyl-3-methyl-7-oxo-1,6-diazabicyclo[3.2.1]oct-3-en-6-yl]oxy}(fluoro)ethanoic acid lithium salt | US10800778, Example 3
Type:
Small organic molecule
Emp. Form.:
C10H12FN3O5
Mol. Mass.:
273.2178
SMILES:
CC1=C[C@@H]2CN([C@@H]1C(N)=O)C(=O)N2O[C@@H](F)C(O)=O
: