Target
Beta-lactamase
Ligand
BDBM466967
Substrate
Meas. Tech.
Inhibition of Beta-Lactamase Enzymes
IC50
14.0±n/a nM
Citation
 Comita-Prevoir, JDurand-Reville, TFGauthier, LO''Donnell, JRomero, JTommasi, RVerheijen, JCWu, FWu, XZhang, J Beta-lactamase inhibitor compounds US Patent  US10800778 Publication Date 10/13/2020 
Target
Name:
Beta-lactamase
Synonyms:
Beta-lactamase Synonyms=blaOXA-48 | bla
Type:
PROTEIN
Mol. Mass.:
30363.94
Organism:
Klebsiella pneumoniae
Description:
ChEMBL_103606
Residue:
265
  
Inhibitor
Name:
BDBM466967
Synonyms:
US10800778, Example 8 | {[(2S,5R)-2-carbamoyl-3-methyl-7-oxo-1,6-diazabicyclo[3.2.1]oct-3-en-6-yl]oxy}(difluoro)acetic acid lithium salt
Type:
Small organic molecule
Emp. Form.:
C10H11F2N3O5
Mol. Mass.:
291.2082
SMILES:
CC1=C[C@@H]2CN([C@@H]1C(N)=O)C(=O)N2OC(F)(F)C(O)=O
: