Target
Beta-lactamase
Ligand
BDBM466970
Substrate
Meas. Tech.
Inhibition of Beta-Lactamase Enzymes
IC50
18.0±n/a nM
Citation
 Comita-Prevoir, JDurand-Reville, TFGauthier, LO''Donnell, JRomero, JTommasi, RVerheijen, JCWu, FWu, XZhang, J Beta-lactamase inhibitor compounds US Patent  US10800778 Publication Date 10/13/2020 
Target
Name:
Beta-lactamase
Synonyms:
Beta-lactamase Synonyms=blaOXA-48 | bla
Type:
PROTEIN
Mol. Mass.:
30363.94
Organism:
Klebsiella pneumoniae
Description:
ChEMBL_103606
Residue:
265
  
Inhibitor
Name:
BDBM466970
Synonyms:
2-(((2S,5R)-2-(2-acetylhydrazinecarbonyl)-3-methyl-7-oxo-1,6-diazabicyclo[3.2.1]oct-3-en-6-yl)oxy)-2-fluoroacetic acid lithium salt | US10800778, Example 27
Type:
Small organic molecule
Emp. Form.:
C12H15FN4O6
Mol. Mass.:
330.2691
SMILES:
CC(=O)NNC(=O)[C@H]1N2C[C@@H](C=C1C)N(OC(F)C(O)=O)C2=O
: