Target
Beta-lactamase TEM
Ligand
BDBM466974
Substrate
Meas. Tech.
Inhibition of Beta-Lactamase Enzymes
IC50
3.50±n/a nM
Citation
 Comita-Prevoir, JDurand-Reville, TFGauthier, LO''Donnell, JRomero, JTommasi, RVerheijen, JCWu, FWu, XZhang, J Beta-lactamase inhibitor compounds US Patent  US10800778 Publication Date 10/13/2020 
Target
Name:
Beta-lactamase TEM
Synonyms:
BLAT_ECOLX Beta-lactamase (TEM-1) Beta-lactamase TEM-1 Beta-lactamase TEM1D Beta-lactamase TEM1F TEM extended-spectrum beta-lactamase bla
Type:
Enzyme
Mol. Mass.:
31512.33
Organism:
Escherichia coli
Description:
P62593
Residue:
286
  
Inhibitor
Name:
BDBM466974
Synonyms:
(2R)-2-(((2S,5R)-2-carbamoyl-3-cyclopropyl-7-oxo-1,6-diazabicyclo[3.2.1]oct-3-en-6-yl)oxy)-2-fluoroacetic acid lithium salt | US10800778, Example 41
Type:
Small organic molecule
Emp. Form.:
C12H14FN3O5
Mol. Mass.:
299.2551
SMILES:
NC(=O)[C@H]1N2C[C@@H](C=C1C1CC1)N(O[C@H](F)C(O)=O)C2=O
: