Target
Beta-lactamase
Ligand
BDBM466977
Substrate
Meas. Tech.
Inhibition of Beta-Lactamase Enzymes
IC50
7.30±n/a nM
Citation
 Comita-Prevoir, JDurand-Reville, TFGauthier, LO''Donnell, JRomero, JTommasi, RVerheijen, JCWu, FWu, XZhang, J Beta-lactamase inhibitor compounds US Patent  US10800778 Publication Date 10/13/2020 
Target
Name:
Beta-lactamase
Synonyms:
Beta-lactamase Synonyms=blaOXA-48 | bla
Type:
PROTEIN
Mol. Mass.:
30363.94
Organism:
Klebsiella pneumoniae
Description:
ChEMBL_103606
Residue:
265
  
Inhibitor
Name:
BDBM466977
Synonyms:
2-[[(2S,5R)-2-(5-carbamoyl-1,3,4-oxadiazol-2-yl)-3-methyl-7-oxo-1,6-diazabicyclo[3.2.1]oct-3-en-6-yl]oxy]-2-fluoro-acetic acid lithium salt | US10800778, Example 55
Type:
Small organic molecule
Emp. Form.:
C12H12FN5O6
Mol. Mass.:
341.252
SMILES:
CC1=C[C@@H]2CN([C@@H]1c1nnc(o1)C(N)=O)C(=O)N2OC(F)C(O)=O
: