Target
Beta-lactamase
Ligand
BDBM466988
Substrate
Meas. Tech.
Inhibition of Beta-Lactamase Enzymes
IC50
110±n/a nM
Citation
 Comita-Prevoir, JDurand-Reville, TFGauthier, LO''Donnell, JRomero, JTommasi, RVerheijen, JCWu, FWu, XZhang, J Beta-lactamase inhibitor compounds US Patent  US10800778 Publication Date 10/13/2020 
Target
Name:
Beta-lactamase
Synonyms:
Beta-lactamase Synonyms=blaOXA-48 | bla
Type:
PROTEIN
Mol. Mass.:
30363.94
Organism:
Klebsiella pneumoniae
Description:
ChEMBL_103606
Residue:
265
  
Inhibitor
Name:
BDBM466988
Synonyms:
(2S)-2-fluoro-2-[[(2S,5R)-3-methyl-7-oxo-2-[(5-oxopyrrolidin-2-yl)methoxycarbamoyl]-1,6-diazabicyclo[3.2.1]oct-3-en-6-yl]oxy]acetic acid lithium salt | US10800778, Example 72
Type:
Small organic molecule
Emp. Form.:
C15H19FN4O7
Mol. Mass.:
386.3324
SMILES:
CC1=C[C@@H]2CN([C@@H]1C(=O)NOC[C@@H]1CCC(=O)N1)C(=O)N2O[C@@H](F)C(O)=O
: