Target
Beta-lactamase
Ligand
BDBM466997
Substrate
Meas. Tech.
Inhibition of Beta-Lactamase Enzymes
IC50
11.0±n/a nM
Citation
 Comita-Prevoir, JDurand-Reville, TFGauthier, LO''Donnell, JRomero, JTommasi, RVerheijen, JCWu, FWu, XZhang, J Beta-lactamase inhibitor compounds US Patent  US10800778 Publication Date 10/13/2020 
Target
Name:
Beta-lactamase
Synonyms:
Beta-lactamase Synonyms=blaOXA-48 | bla
Type:
PROTEIN
Mol. Mass.:
30363.94
Organism:
Klebsiella pneumoniae
Description:
ChEMBL_103606
Residue:
265
  
Inhibitor
Name:
BDBM466997
Synonyms:
(2S)-2-fluoro-2-[[(2S,5R)-2-(hydroxymethylcarbamoyl)-3-methyl-7-oxo-1,6-diazabicyclo[3.2.1]oct-3-en-6-yl]oxy]acetic acid lithium salt | US10800778, Example 87
Type:
Small organic molecule
Emp. Form.:
C11H14FN3O6
Mol. Mass.:
303.2438
SMILES:
CC1=C[C@@H]2CN([C@@H]1C(=O)NCO)C(=O)N2O[C@@H](F)C(O)=O
: