Target
Beta-lactamase
Ligand
BDBM467003
Substrate
Meas. Tech.
Inhibition of Beta-Lactamase Enzymes
IC50
2000±n/a nM
Citation
 Comita-Prevoir, JDurand-Reville, TFGauthier, LO''Donnell, JRomero, JTommasi, RVerheijen, JCWu, FWu, XZhang, J Beta-lactamase inhibitor compounds US Patent  US10800778 Publication Date 10/13/2020 
Target
Name:
Beta-lactamase
Synonyms:
AMPC_ECOLI Beta-lactamase (AmpC) Cephalosporinase ampA | ampC
Type:
Protien
Mol. Mass.:
41561.62
Organism:
Escherichia coli
Description:
P00811
Residue:
377
  
Inhibitor
Name:
BDBM467003
Synonyms:
US10800778, Comparator 98
Type:
Small organic molecule
Emp. Form.:
C9H12FN3O5
Mol. Mass.:
261.2071
SMILES:
NC(=O)[C@@H]1CC[C@@H]2CN1C(=O)N2O[C@H](F)C(O)=O
: