Target
Lysine-specific histone demethylase 1A
Ligand
BDBM388913
Substrate
Meas. Tech.
LSD1 histone demethylase biochemical assay
IC50
<50±n/a nM
Citation
 He, CLi, ZWu, LYao, WZhang, F Heterocyclic compounds as LSD1 inhibitors US Patent  US10800779 Publication Date 10/13/2020 
Target
Name:
Lysine-specific histone demethylase 1A
Synonyms:
AOF2 Flavin-containing amine oxidase domain-containing protein 2 KDM1A KIAA0601 Lysine-specific demethylase 1 (LSD1) Lysine-specific histone demethylase 1 (LSD1)
Type:
Enzyme
Mol. Mass.:
92901.01
Organism:
Homo sapiens (Human)
Description:
O60341
Residue:
852
  
Inhibitor
Name:
BDBM388913
Synonyms:
4-[5-{[(3R)-1-(2-hydroxyethyl)piperidin-3-yl]methoxy}-8-(1-methyl-1H-pyrazolo[3,4-b]pyridin-5-yl)imidazo[1,2-c]pyrimidin-7-yl]benzonitrile US11401272, Example 34 | US9944647, Example 34
Type:
Small organic molecule
Emp. Form.:
C28H28N8O2
Mol. Mass.:
508.5743
SMILES:
Cn1ncc2cc(cnc12)-c1c(nc(OC[C@@H]2CCCN(CCO)C2)n2ccnc12)-c1ccc(cc1)C#N
: