Target
Lysine-specific histone demethylase 1A
Ligand
BDBM388926
Substrate
Meas. Tech.
LSD1 histone demethylase biochemical assay
IC50
<50±n/a nM
Citation
 He, CLi, ZWu, LYao, WZhang, F Heterocyclic compounds as LSD1 inhibitors US Patent  US10800779 Publication Date 10/13/2020 
Target
Name:
Lysine-specific histone demethylase 1A
Synonyms:
AOF2 Flavin-containing amine oxidase domain-containing protein 2 KDM1A KIAA0601 Lysine-specific demethylase 1 (LSD1) Lysine-specific histone demethylase 1 (LSD1)
Type:
Enzyme
Mol. Mass.:
92901.01
Organism:
Homo sapiens (Human)
Description:
O60341
Residue:
852
  
Inhibitor
Name:
BDBM388926
Synonyms:
4-[5-[4-(dimethylamino)piperidin-1-yl]-8-(1-methyl-1H-indazol-5-yl)imidazo[1,2-c]pyrimidin-7-yl]benzonitrile US11401272, Example 46 | US9944647, Example 46
Type:
Small organic molecule
Emp. Form.:
C28H28N8
Mol. Mass.:
476.5755
SMILES:
CN(C)C1CCN(CC1)c1nc(-c2ccc(cc2)C#N)c(-c2ccc3n(C)ncc3c2)c2nccn12
: