Target
Lysine-specific histone demethylase 1A
Ligand
BDBM388929
Substrate
Meas. Tech.
LSD1 histone demethylase biochemical assay
IC50
275±n/a nM
Citation
 He, CLi, ZWu, LYao, WZhang, F Heterocyclic compounds as LSD1 inhibitors US Patent  US10800779 Publication Date 10/13/2020 
Target
Name:
Lysine-specific histone demethylase 1A
Synonyms:
AOF2 Flavin-containing amine oxidase domain-containing protein 2 KDM1A KIAA0601 Lysine-specific demethylase 1 (LSD1) Lysine-specific histone demethylase 1 (LSD1)
Type:
Enzyme
Mol. Mass.:
92901.01
Organism:
Homo sapiens (Human)
Description:
O60341
Residue:
852
  
Inhibitor
Name:
BDBM388929
Synonyms:
4-[5-[4-(dimethylamino)piperidin-1-yl]-8-(6-methoxypyridin-3-yl)imidazo[1,2-c]pyrimidin-7-yl]benzonitrile US11401272, Example 48 | US9944647, Example 48
Type:
Small organic molecule
Emp. Form.:
C26H27N7O
Mol. Mass.:
453.5389
SMILES:
COc1ccc(cn1)-c1c(nc(N2CCC(CC2)N(C)C)n2ccnc12)-c1ccc(cc1)C#N
: