Target
Lysine-specific histone demethylase 1A
Ligand
BDBM388948
Substrate
Meas. Tech.
LSD1 histone demethylase biochemical assay
IC50
<50±n/a nM
Citation
 He, CLi, ZWu, LYao, WZhang, F Heterocyclic compounds as LSD1 inhibitors US Patent  US10800779 Publication Date 10/13/2020 
Target
Name:
Lysine-specific histone demethylase 1A
Synonyms:
AOF2 Flavin-containing amine oxidase domain-containing protein 2 KDM1A KIAA0601 Lysine-specific demethylase 1 (LSD1) Lysine-specific histone demethylase 1 (LSD1)
Type:
Enzyme
Mol. Mass.:
92901.01
Organism:
Homo sapiens (Human)
Description:
O60341
Residue:
852
  
Inhibitor
Name:
BDBM388948
Synonyms:
4-(8-(1,2-dimethyl-1H-benzimidazol-5-yl)-5-{[(3R)-1-methylpiperidin-3-yl]methoxy}imidazo[1,2-c]pyrimidin-7-yl)benzonitrile US11401272, Example 65 | US9944647, Example 65
Type:
Small organic molecule
Emp. Form.:
C29H29N7O
Mol. Mass.:
491.5869
SMILES:
CN1CCC[C@@H](COc2nc(-c3ccc(cc3)C#N)c(-c3ccc4n(C)c(C)nc4c3)c3nccn23)C1
: