Target
Lysine-specific histone demethylase 1A
Ligand
BDBM388995
Substrate
Meas. Tech.
LSD1 histone demethylase biochemical assay
IC50
<50±n/a nM
Citation
 He, CLi, ZWu, LYao, WZhang, F Heterocyclic compounds as LSD1 inhibitors US Patent  US10800779 Publication Date 10/13/2020 
Target
Name:
Lysine-specific histone demethylase 1A
Synonyms:
AOF2 Flavin-containing amine oxidase domain-containing protein 2 KDM1A KIAA0601 Lysine-specific demethylase 1 (LSD1) Lysine-specific histone demethylase 1 (LSD1)
Type:
Enzyme
Mol. Mass.:
92901.01
Organism:
Homo sapiens (Human)
Description:
O60341
Residue:
852
  
Inhibitor
Name:
BDBM388995
Synonyms:
4-{8-(5-chloro-6-methoxypyridin-3- yl)-5-[4-(dimethylamino)piperidin-1- yl]imidazo[1,2-c]pyrimidin-7- yl}benzonitrile US11401272, Example 104 | US9944647, Example 104
Type:
Small organic molecule
Emp. Form.:
C26H26ClN7O
Mol. Mass.:
487.984
SMILES:
COc1ncc(cc1Cl)-c1c(nc(N2CCC(CC2)N(C)C)n2ccnc12)-c1ccc(cc1)C#N
: