Target
Lysine-specific histone demethylase 1A
Ligand
BDBM389023
Substrate
Meas. Tech.
LSD1 histone demethylase biochemical assay
IC50
275±n/a nM
Citation
 He, CLi, ZWu, LYao, WZhang, F Heterocyclic compounds as LSD1 inhibitors US Patent  US10800779 Publication Date 10/13/2020 
Target
Name:
Lysine-specific histone demethylase 1A
Synonyms:
AOF2 Flavin-containing amine oxidase domain-containing protein 2 KDM1A KIAA0601 Lysine-specific demethylase 1 (LSD1) Lysine-specific histone demethylase 1 (LSD1)
Type:
Enzyme
Mol. Mass.:
92901.01
Organism:
Homo sapiens (Human)
Description:
O60341
Residue:
852
  
Inhibitor
Name:
BDBM389023
Synonyms:
4-{8-[5-(difluoromethyl)-6- methylpyridin-3-yl]-5-[4- (dimethylamino)piperidin-1- yl]imidazo[1,2-c]pyrimidin-7- yl}benzonitrile US11401272, Example 132 | US9944647, Example 132
Type:
Small organic molecule
Emp. Form.:
C27H27F2N7
Mol. Mass.:
487.547
SMILES:
CN(C)C1CCN(CC1)c1nc(-c2ccc(cc2)C#N)c(-c2cnc(C)c(c2)C(F)F)c2nccn12
: