Target
[Pyruvate dehydrogenase (acetyl-transferring)] kinase isozyme 1, mitochondrial
Ligand
BDBM467062
Substrate
Meas. Tech.
Inhibitory Action of PDHK1 Activity In Vitro
IC50
4.00±n/a nM
Citation
 Maeba, TSuzawa, KKotoku, MMasuo, RMotoda, DYamaoka, N Nitrogen-containing heterocyclic amide compound and pharmaceutical use thereof US Patent  US10800784 Publication Date 10/13/2020 
Target
Name:
[Pyruvate dehydrogenase (acetyl-transferring)] kinase isozyme 1, mitochondrial
Synonyms:
PDHK1 PDK1_HUMAN Pyruvate dehydrogenase kinase 1 (PDK1) | Pyruvate dehydrogenase kinase isoform 1
Type:
Protein
Mol. Mass.:
49255.23
Organism:
Homo sapiens (Human)
Description:
Q15118
Residue:
436
  
Inhibitor
Name:
BDBM467062
Synonyms:
US10800784, Example 51
Type:
Small organic molecule
Emp. Form.:
C21H24F3N3O3
Mol. Mass.:
423.4288
SMILES:
C[C@H]1CN(Cc2cnc(n12)[C@@](C)(O)C(F)(F)F)C(=O)c1ccc(cc1)C1(O)CCC1
: