Target
Ataxin-1
Ligand
BDBM467326
Substrate
Meas. Tech.
Human Atx Enzyme Inhibition Assay
IC50
1.000±n/a nM
Citation
 Mattei, PHert, JHunziker, DRudolph, MSchmitz, PDi Giorgio, P Bicyclic compounds as ATX inhibitors US Patent  US10800786 Publication Date 10/13/2020 
Target
Name:
Ataxin-1
Synonyms:
ATX1 ATXN1 | SCA1
Type:
Protein
Mol. Mass.:
86941.25
Organism:
Homo sapiens (Human)
Description:
P54253
Residue:
815
  
Inhibitor
Name:
BDBM467326
Synonyms:
US10800786, Example 2.01
Type:
Small organic molecule
Emp. Form.:
C28H33N5O6
Mol. Mass.:
535.5915
SMILES:
Oc1noc2CN(CCc12)C(=O)N1CC2=C(C1)CN(C2)C(=O)c1cc(OCC2CCOCC2)nc(c1)C1CC1
: