Target
Ataxin-1
Ligand
BDBM467334
Substrate
Meas. Tech.
Human Atx Enzyme Inhibition Assay
IC50
5.00±n/a nM
Citation
 Mattei, PHert, JHunziker, DRudolph, MSchmitz, PDi Giorgio, P Bicyclic compounds as ATX inhibitors US Patent  US10800786 Publication Date 10/13/2020 
Target
Name:
Ataxin-1
Synonyms:
ATX1 ATXN1 | SCA1
Type:
Protein
Mol. Mass.:
86941.25
Organism:
Homo sapiens (Human)
Description:
P54253
Residue:
815
  
Inhibitor
Name:
BDBM467334
Synonyms:
US10800786, Example 2.06
Type:
Small organic molecule
Emp. Form.:
C26H29F3N6O6
Mol. Mass.:
578.5403
SMILES:
CC(C)(C)C(=O)Nc1cc(cnc1COC(=O)N1CC2=C(C1)CN(C2)C(=O)N1CCc2c(O)noc2C1)C(F)(F)F
: