Target
Tyrosine-protein kinase BTK
Ligand
BDBM467866
Substrate
Meas. Tech.
TBD
IC50
7.94±n/a nM
Citation
 Arora, NBacani, GMBarbay, JKBembenek, SDCai, MChen, WDeckhut, CPEdwards, JPGhosh, BHao, BKreutter, KDLi, GTichenor, MSVenable, JDWei, JWiener, JJWu, YZhu, YZhang, FZhang, ZXiao, K Inhibitors of Bruton's tyrosine kinase and method of their use US Patent  US10800792 Publication Date 10/13/2020 
Target
Name:
Tyrosine-protein kinase BTK
Synonyms:
AGMX1 Agammaglobulinaemia tyrosine kinase B cell progenitor kinase BPK BTK_HUMAN Tyrosine Kinase BTK Tyrosine-protein kinase BTK (BTK)
Type:
Enzyme
Mol. Mass.:
76289.95
Organism:
Homo sapiens (Human)
Description:
Q06187
Residue:
659
  
Inhibitor
Name:
BDBM467866
Synonyms:
(R)-N-(1-Acryloylpiperidin-3-yl)-4-oxo-5-(3-phenoxyphenyl)-4,5- dihydro-3H-1-thia-3,5,8-triazaacenaphthylene-2-carboxamide; US10822348, Example 527
Type:
Small organic molecule
Emp. Form.:
C29H25N5O4S
Mol. Mass.:
539.605
SMILES:
C=CC(=O)N1CCC[C@H](C1)NC(=O)c1sc2nccc3n(-c4cccc(Oc5ccccc5)c4)c(=O)[nH]c1c23
: