Target
Tyrosine-protein kinase BTK
Ligand
BDBM468083
Substrate
Meas. Tech.
TBD
IC50
7.94±n/a nM
Citation
 Arora, NBacani, GMBarbay, JKBembenek, SDCai, MChen, WDeckhut, CPEdwards, JPGhosh, BHao, BKreutter, KDLi, GTichenor, MSVenable, JDWei, JWiener, JJWu, YZhu, YZhang, FZhang, ZXiao, K Inhibitors of Bruton's tyrosine kinase and method of their use US Patent  US10800792 Publication Date 10/13/2020 
Target
Name:
Tyrosine-protein kinase BTK
Synonyms:
AGMX1 Agammaglobulinaemia tyrosine kinase B cell progenitor kinase BPK BTK_HUMAN Tyrosine Kinase BTK Tyrosine-protein kinase BTK (BTK)
Type:
Enzyme
Mol. Mass.:
76289.95
Organism:
Homo sapiens (Human)
Description:
Q06187
Residue:
659
  
Inhibitor
Name:
BDBM468083
Synonyms:
(R)-N-(1-Acryloylpiperidin-3-yl)-5-(*S)-(4-methyl-2- phenoxypyrimidin-5-yl)-4-oxo-4,5-dihydro-3H-1-thia-3,5,8- triazaacenaphthylene-2-carboxamide; US10822348, Example 746
Type:
Small organic molecule
Emp. Form.:
C28H25N7O4S
Mol. Mass.:
555.608
SMILES:
Cc1nc(Oc2ccccc2)ncc1-n1c2ccnc3sc(C(=O)N[C@@H]4CCCN(C4)C(=O)C=C)c([nH]c1=O)c23
: