Target
Androgen receptor
Ligand
BDBM50529667
Substrate
Meas. Tech.
Human Androgen Receptor (hAR) Ligand Binding Domain (LBD) Affinity Assay
IC50
85.1±n/a nM
Citation
 Narayanan, RMiller, DDPonnusamy, THwang, DHe, Y Selective androgen receptor degrader (SARD) ligands and methods of use thereof US Patent  US10806720 Publication Date 10/20/2020 
Target
Name:
Androgen receptor
Synonyms:
ANDR_HUMAN Androgen Receptor Androgen receptor/Baculoviral IAP repeat-containing protein 2 Dihydrotestosterone receptor Nuclear receptor subfamily 3 group C member 4
Type:
Receptor
Mol. Mass.:
99185.27
Organism:
Homo sapiens (Human)
Description:
CHO cells were stably transfected with human AR gene.
Residue:
920
  
Inhibitor
Name:
BDBM50529667
Synonyms:
CHEMBL4444904 US11230523, Compound 11 | US11648234, Compound 11
Type:
Small organic molecule
Emp. Form.:
C20H15F4N3O2
Mol. Mass.:
405.3456
SMILES:
C[C@](O)(Cn1ccc2cc(F)ccc12)C(=O)Nc1ccc(C#N)c(c1)C(F)(F)F
: