Target
Androgen receptor
Ligand
BDBM468355
Substrate
Meas. Tech.
Human Androgen Receptor (hAR) Ligand Binding Domain (LBD) Affinity Assay
IC50
2470±n/a nM
Citation
 Narayanan, RMiller, DDPonnusamy, THwang, DHe, Y Selective androgen receptor degrader (SARD) ligands and methods of use thereof US Patent  US10806720 Publication Date 10/20/2020 
Target
Name:
Androgen receptor
Synonyms:
ANDR_HUMAN Androgen Receptor Androgen receptor/Baculoviral IAP repeat-containing protein 2 Dihydrotestosterone receptor Nuclear receptor subfamily 3 group C member 4
Type:
Receptor
Mol. Mass.:
99185.27
Organism:
Homo sapiens (Human)
Description:
CHO cells were stably transfected with human AR gene.
Residue:
920
  
Inhibitor
Name:
BDBM468355
Synonyms:
US10806720, Compound 1041 | US11648234, Compound 1041
Type:
Small organic molecule
Emp. Form.:
C12H12ClFN4O2
Mol. Mass.:
298.701
SMILES:
C[C@](O)(Cn1cc(F)cn1)C(=O)Nc1ccnc(Cl)c1
: