Target
Metabotropic glutamate receptor 2
Ligand
BDBM403478
Substrate
Meas. Tech.
Biological Assays
IC50
27.0±n/a nM
Citation
 Sebhat, IKArasappan, AHoyt, SBWilkening, RRDeMong, D Chromane, isochromane and dihydroisobenzofuran derivatives as mGluR2-negative allosteric modulators, compositions, and their use US Patent  US10806724 Publication Date 10/20/2020 
Target
Name:
Metabotropic glutamate receptor 2
Synonyms:
GPRC1B GRM2_HUMAN Metabotropic glutamate receptor mGlu2 | metabotropic glutamate 2
Type:
Enzyme
Mol. Mass.:
95584.88
Organism:
Homo sapiens (Human)
Description:
Q14416
Residue:
872
  
Inhibitor
Name:
BDBM403478
Synonyms:
US10335399, Example 3-5A | US10806724, Example 3-5B
Type:
Small organic molecule
Emp. Form.:
C17H16F2N2O3
Mol. Mass.:
334.3173
SMILES:
COC[C@H]1CCc2c(O1)nc(cc2-c1ccc(F)cc1F)C(N)=O
: