Target
Metabotropic glutamate receptor 2
Ligand
BDBM403487
Substrate
Meas. Tech.
Biological Assays
IC50
19.0±n/a nM
Citation
 Sebhat, IKArasappan, AHoyt, SBWilkening, RRDeMong, D Chromane, isochromane and dihydroisobenzofuran derivatives as mGluR2-negative allosteric modulators, compositions, and their use US Patent  US10806724 Publication Date 10/20/2020 
Target
Name:
Metabotropic glutamate receptor 2
Synonyms:
GPRC1B GRM2_HUMAN Metabotropic glutamate receptor mGlu2 | metabotropic glutamate 2
Type:
Enzyme
Mol. Mass.:
95584.88
Organism:
Homo sapiens (Human)
Description:
Q14416
Residue:
872
  
Inhibitor
Name:
BDBM403487
Synonyms:
US10335399, Example 3-9B | US10806724, Example 3-9B
Type:
Small organic molecule
Emp. Form.:
C18H16F4N2O3
Mol. Mass.:
384.3249
SMILES:
C[C@H]1Cc2c(O[C@@H]1COC(F)F)nc(cc2-c1ccc(F)cc1F)C(N)=O
: