Target
Programmed cell death 1 ligand 1 [19-238]/protein 1 [25-167]
Ligand
BDBM468397
Substrate
Meas. Tech.
Homogeneous Time-Resolved Fluorescence (HERF)
IC50
<0.1±n/a nM
Citation
 Lu, LZhu, WQian, DXiao, K Immunomodulator compounds and methods of use US Patent  US10806785 Publication Date 10/20/2020 
Target
Name:
Programmed cell death 1 ligand 1 [19-238]/protein 1 [25-167]
Synonyms:
PD-1/PD-L1
Type:
Protein
Mol. Mass.:
Description:
Components:
This complex has 2 components.
Component 1
Name:
Programmed cell death protein 1 [25-167]
Synonyms:
PD1 PDCD1_HUMAN Programmed cell death protein 1 (aa25-167) hPD-1
Type:
Enzyme Catalytic Domain
Mol. Mass.:
15954.64
Organism:
Homo sapiens (Human)
Description:
Q15116 (aa25-167)
Residue:
143
  
Component 2
Name:
Programmed cell death 1 ligand 1 [19-238]
Synonyms:
B7H1 PD-L1 PDCD1 ligand 1 PDCD1LG1 Programmed cell death 1 ligand 1 (aa19-238) hPD-L1
Type:
Enzyme Catalytic Domain
Mol. Mass.:
25191.31
Organism:
Homo sapiens (Human)
Description:
Q9NZQ7 (aa19-238)
Residue:
220
  
Inhibitor
Name:
BDBM468397
Synonyms:
N-(2-chloro-2′-methyl-3′-(1-methyl-5-(3-(methylsulfonamido)propyl)-4,5,6,7-tetrahydro-1H-imidazo[4,5-c]pyridine-2-carboxamido)biphenyl-3-yl)-1,5-dimethyl-4,5,6,7-tetrahydro-1H-imidazo[4,5-c]pyridine-2-carboxamide | US10806785, Example 36
Type:
Small organic molecule
Emp. Form.:
C34H42ClN9O4S
Mol. Mass.:
708.273
SMILES:
CN1CCc2c(C1)nc(C(=O)Nc1cccc(c1Cl)-c1cccc(NC(=O)c3nc4CN(CCCNS(C)(=O)=O)CCc4n3C)c1C)n2C
: