Target
Programmed cell death 1 ligand 1 [19-238]/protein 1 [25-167]
Ligand
BDBM468457
Substrate
Meas. Tech.
Homogeneous Time-Resolved Fluorescence (HERF)
IC50
<0.1±n/a nM
Citation
 Lu, LZhu, WQian, DXiao, K Immunomodulator compounds and methods of use US Patent  US10806785 Publication Date 10/20/2020 
Target
Name:
Programmed cell death 1 ligand 1 [19-238]/protein 1 [25-167]
Synonyms:
PD-1/PD-L1
Type:
Protein
Mol. Mass.:
Description:
Components:
This complex has 2 components.
Component 1
Name:
Programmed cell death protein 1 [25-167]
Synonyms:
PD1 PDCD1_HUMAN Programmed cell death protein 1 (aa25-167) hPD-1
Type:
Enzyme Catalytic Domain
Mol. Mass.:
15954.64
Organism:
Homo sapiens (Human)
Description:
Q15116 (aa25-167)
Residue:
143
  
Component 2
Name:
Programmed cell death 1 ligand 1 [19-238]
Synonyms:
B7H1 PD-L1 PDCD1 ligand 1 PDCD1LG1 Programmed cell death 1 ligand 1 (aa19-238) hPD-L1
Type:
Enzyme Catalytic Domain
Mol. Mass.:
25191.31
Organism:
Homo sapiens (Human)
Description:
Q9NZQ7 (aa19-238)
Residue:
220
  
Inhibitor
Name:
BDBM468457
Synonyms:
4-(2-((2,2′-dichloro-3′-(1-methyl-5-(tetrahydro-2H-pyran-4-yl)-4,5,6,7-tetrahydro-1H-imidazo[4,5-c]pyridine-2-carboxamido)-[1,1′-biphenyl]-3-yl)carbamoyl)-1-methyl-1,4,6,7-tetrahydro-5H-imidazo[4,5-c]pyridin-5-yl)-1-ethylcyclohexane-1-carboxylic acid | US10806785, Example 99
Type:
Small organic molecule
Emp. Form.:
C42H50Cl2N8O5
Mol. Mass.:
817.803
SMILES:
CCC1(CCC(CC1)N1CCc2c(C1)nc(C(=O)Nc1cccc(c1Cl)-c1cccc(NC(=O)c3nc4CN(CCc4n3C)C3CCOCC3)c1Cl)n2C)C(O)=O
: