Target
HIV-1 protease
Ligand
BDBM468305
Substrate
Meas. Tech.
Enzyme Inhibition of Purified HIV-1 Protease
IC50
10.9±n/a nM
Citation
 Jude-Fishburn, CSVanderVeen, LARiley, TA Protease inhibitors having enhanced features US Patent  US10806794 Publication Date 10/20/2020 
Target
Name:
HIV-1 protease
Synonyms:
HIV-1 protease wild type
Type:
Protein
Mol. Mass.:
10757.68
Organism:
Human immunodeficiency virus
Description:
O90785
Residue:
99
  
Inhibitor
Name:
BDBM468305
Synonyms:
US10806794, Compound di-mPEG7-Atazanavir
Type:
Small organic molecule
Emp. Form.:
C66H108N6O21
Mol. Mass.:
1321.5913
SMILES:
(=O)N[C@@H](C(=O)NC(Cc1ccccc1)[C@@H](O)CN(Cc1ccc(cc1)-c1ccccn1)NC(=O)[C@H](NC(=O)OCCOCCOCCOCCOCCOCCOCCOC)C(C)(C)C)C(C)(C)C
: