Target
HIV-1 protease
Ligand
BDBM468365
Substrate
Meas. Tech.
Enzyme Inhibition of Purified HIV-1 Protease
IC50
2.82±n/a nM
Citation
 Jude-Fishburn, CSVanderVeen, LARiley, TA Protease inhibitors having enhanced features US Patent  US10806794 Publication Date 10/20/2020 
Target
Name:
HIV-1 protease
Synonyms:
HIV-1 protease wild type
Type:
Protein
Mol. Mass.:
10757.68
Organism:
Human immunodeficiency virus
Description:
O90785
Residue:
99
  
Inhibitor
Name:
BDBM468365
Synonyms:
US10806794, Compound mono-mPEG1-Atazanavir
Type:
Small organic molecule
Emp. Form.:
C40H56N6O8
Mol. Mass.:
748.908
SMILES:
COCCOC(=O)NC(C(=O)NC(Cc1ccccc1)C(O)CN(Cc1ccc(cc1)-c1ccccn1)NC(=O)C(NC(=O)OC)C(C)(C)C)C(C)(C)C
: