Target
HIV-1 protease
Ligand
BDBM468574
Substrate
Meas. Tech.
Enzyme Inhibition of Purified HIV-1 Protease
IC50
0.050±n/a nM
Citation
 Jude-Fishburn, CSVanderVeen, LARiley, TA Protease inhibitors having enhanced features US Patent  US10806794 Publication Date 10/20/2020 
Target
Name:
HIV-1 protease
Synonyms:
HIV-1 protease wild type
Type:
Protein
Mol. Mass.:
10757.68
Organism:
Human immunodeficiency virus
Description:
O90785
Residue:
99
  
Inhibitor
Name:
BDBM468574
Synonyms:
US10806794, Compound mPEG7-NHCO-Saquinavir
Type:
Small organic molecule
Emp. Form.:
C53H80N6O12
Mol. Mass.:
993.2353
SMILES:
(=O)C[C@H](NC(=O)c1ccc2ccccc2n1)C(=O)N[C@@H](Cc1ccccc1)[C@H](O)CN1C[C@H]2CCCC[C@H]2C[C@H]1C(=O)NC(C)(C)C
: