Target
Histone deacetylase 2
Ligand
BDBM163620
Substrate
Meas. Tech.
HDAC Inhibition
IC50
15100±n/a nM
Citation
 Liao, DRoush, WRStowe, RL HDAC inhibitor compounds and methods of treatment US Patent  US10807944 Publication Date 10/20/2020 
Target
Name:
Histone deacetylase 2
Synonyms:
Cereblon/Histone deacetylase 2 HDAC2 Histone deacetylase 2 (HDAC2) | Human HDAC2
Type:
Chromatin regulator; hydrolase; repressor
Mol. Mass.:
55356.54
Organism:
Homo sapiens (Human)
Description:
Q92769
Residue:
488
  
Inhibitor
Name:
BDBM163620
Synonyms:
SR-3203 US11731934, Compound RLS2-306
Type:
Small organic molecule
Emp. Form.:
C11H15FN2O
Mol. Mass.:
210.248
SMILES:
CCCCNNC(=O)c1ccc(F)cc1
: