Target
Histone deacetylase 1
Ligand
BDBM163623
Substrate
Meas. Tech.
HDAC Inhibition
IC50
1910±n/a nM
Citation
 Liao, DRoush, WRStowe, RL HDAC inhibitor compounds and methods of treatment US Patent  US10807944 Publication Date 10/20/2020 
Target
Name:
Histone deacetylase 1
Synonyms:
Cereblon/Histone deacetylase 1 HDAC1 Histone deacetylase 1 (HDAC1) RPD3L1
Type:
Enzyme
Mol. Mass.:
55090.27
Organism:
Homo sapiens (Human)
Description:
Q13547
Residue:
482
  
Inhibitor
Name:
BDBM163623
Synonyms:
SR-3206 US10870618, Compound 1a | US11731934, Compound RLS2-126
Type:
Small organic molecule
Emp. Form.:
C12H18N2O2
Mol. Mass.:
222.2835
SMILES:
CCCCNNC(=O)c1ccc(OC)cc1
: