Target
Histone deacetylase 3
Ligand
BDBM163624
Substrate
Meas. Tech.
HDAC Inhibition
IC50
120±n/a nM
Citation
 Liao, DRoush, WRStowe, RL HDAC inhibitor compounds and methods of treatment US Patent  US10807944 Publication Date 10/20/2020 
Target
Name:
Histone deacetylase 3
Synonyms:
HD3 HDAC3_HUMAN Human HDAC3 SMAP45
Type:
Enzyme
Mol. Mass.:
48829.55
Organism:
Homo sapiens (Human)
Description:
O15379
Residue:
428
  
Inhibitor
Name:
BDBM163624
Synonyms:
SR-3208 US11731934, Compound RLS2-131
Type:
Small organic molecule
Emp. Form.:
C13H21N3O
Mol. Mass.:
235.3253
SMILES:
CCCCNNC(=O)c1ccc(cc1)N(C)C
: