Target
Histone deacetylase 3
Ligand
BDBM163628
Substrate
Meas. Tech.
HDAC Inhibition
IC50
220±n/a nM
Citation
 Liao, DRoush, WRStowe, RL HDAC inhibitor compounds and methods of treatment US Patent  US10807944 Publication Date 10/20/2020 
Target
Name:
Histone deacetylase 3
Synonyms:
HD3 HDAC3_HUMAN Human HDAC3 SMAP45
Type:
Enzyme
Mol. Mass.:
48829.55
Organism:
Homo sapiens (Human)
Description:
O15379
Residue:
428
  
Inhibitor
Name:
BDBM163628
Synonyms:
SR-3212 US11731934, Compound RLS2-137
Type:
Small organic molecule
Emp. Form.:
C10H13BrN2O
Mol. Mass.:
257.127
SMILES:
CCCNNC(=O)c1ccc(Br)cc1
: