Target
Histone deacetylase 3
Ligand
BDBM468586
Substrate
Meas. Tech.
HDAC Inhibition
IC50
1790±n/a nM
Citation
 Liao, DRoush, WRStowe, RL HDAC inhibitor compounds and methods of treatment US Patent  US10807944 Publication Date 10/20/2020 
Target
Name:
Histone deacetylase 3
Synonyms:
HD3 HDAC3_HUMAN Human HDAC3 SMAP45
Type:
Enzyme
Mol. Mass.:
48829.55
Organism:
Homo sapiens (Human)
Description:
O15379
Residue:
428
  
Inhibitor
Name:
BDBM468586
Synonyms:
US10807944, Compound RLS2-238 US11731934, Compound RLS2-238
Type:
Small organic molecule
Emp. Form.:
C15H18N2O
Mol. Mass.:
242.3162
SMILES:
CCCCNNC(=O)c1ccc2ccccc2c1
: