Target
Histone deacetylase 1
Ligand
BDBM468598
Substrate
Meas. Tech.
HDAC Inhibition
IC50
4284±n/a nM
Citation
 Liao, DRoush, WRStowe, RL HDAC inhibitor compounds and methods of treatment US Patent  US10807944 Publication Date 10/20/2020 
Target
Name:
Histone deacetylase 1
Synonyms:
Cereblon/Histone deacetylase 1 HDAC1 Histone deacetylase 1 (HDAC1) RPD3L1
Type:
Enzyme
Mol. Mass.:
55090.27
Organism:
Homo sapiens (Human)
Description:
Q13547
Residue:
482
  
Inhibitor
Name:
BDBM468598
Synonyms:
US10807944, Compound RLS2-290 | US11731934, Compound RLS2-290
Type:
Small organic molecule
Emp. Form.:
C10H15N3O
Mol. Mass.:
193.2456
SMILES:
CCCCNNC(=O)c1ccncc1
: