Target
Histone deacetylase 8
Ligand
BDBM468602
Substrate
Meas. Tech.
HDAC Inhibition
IC50
886±n/a nM
Citation
 Liao, DRoush, WRStowe, RL HDAC inhibitor compounds and methods of treatment US Patent  US10807944 Publication Date 10/20/2020 
Target
Name:
Histone deacetylase 8
Synonyms:
HD8 HDAC8_HUMAN Histone deacetylase 8 (HDAC-8) | Human HDAC8
Type:
Enzyme
Mol. Mass.:
41749.60
Organism:
Homo sapiens (Human)
Description:
Q9BY41
Residue:
377
  
Inhibitor
Name:
BDBM468602
Synonyms:
US10807944, Compound RLS2-312 | US11731934, Compound RLS2-312
Type:
Small organic molecule
Emp. Form.:
C12H17N5O
Mol. Mass.:
247.2963
SMILES:
CCCCNNC(=O)c1ccc(CN=[N+]=[N-])cc1
: