Target
Histone deacetylase 1
Ligand
BDBM468603
Substrate
Meas. Tech.
HDAC Inhibition
IC50
>50000±n/a nM
Citation
 Liao, DRoush, WRStowe, RL HDAC inhibitor compounds and methods of treatment US Patent  US10807944 Publication Date 10/20/2020 
Target
Name:
Histone deacetylase 1
Synonyms:
Cereblon/Histone deacetylase 1 HDAC1 Histone deacetylase 1 (HDAC1) RPD3L1
Type:
Enzyme
Mol. Mass.:
55090.27
Organism:
Homo sapiens (Human)
Description:
Q13547
Residue:
482
  
Inhibitor
Name:
BDBM468603
Synonyms:
US10807944, Compound RLS3-4 | US11731934, Compound RLS3-20
Type:
Small organic molecule
Emp. Form.:
C17H20N2O
Mol. Mass.:
268.3535
SMILES:
CCCCNNC(=O)c1ccccc1-c1ccccc1
: