Target
Histone deacetylase 3
Ligand
BDBM468610
Substrate
Meas. Tech.
HDAC Inhibition
IC50
2290±n/a nM
Citation
 Liao, DRoush, WRStowe, RL HDAC inhibitor compounds and methods of treatment US Patent  US10807944 Publication Date 10/20/2020 
Target
Name:
Histone deacetylase 3
Synonyms:
HD3 HDAC3_HUMAN Human HDAC3 SMAP45
Type:
Enzyme
Mol. Mass.:
48829.55
Organism:
Homo sapiens (Human)
Description:
O15379
Residue:
428
  
Inhibitor
Name:
BDBM468610
Synonyms:
US10807944, Compound SR-4369 | US11731934, Compound SR-4369
Type:
Small organic molecule
Emp. Form.:
C15H18N4O
Mol. Mass.:
270.3296
SMILES:
CCCCNNC(=O)c1ccc(cc1)-c1cncnc1
: