Target
Histone deacetylase 2
Ligand
BDBM468612
Substrate
Meas. Tech.
HDAC Inhibition
IC50
1200±n/a nM
Citation
 Liao, DRoush, WRStowe, RL HDAC inhibitor compounds and methods of treatment US Patent  US10807944 Publication Date 10/20/2020 
Target
Name:
Histone deacetylase 2
Synonyms:
Cereblon/Histone deacetylase 2 HDAC2 Histone deacetylase 2 (HDAC2) | Human HDAC2
Type:
Chromatin regulator; hydrolase; repressor
Mol. Mass.:
55356.54
Organism:
Homo sapiens (Human)
Description:
Q92769
Residue:
488
  
Inhibitor
Name:
BDBM468612
Synonyms:
US10807944, Compound SR-4372 | US11731934, Compound SR-4372
Type:
Small organic molecule
Emp. Form.:
C18H21FN2O
Mol. Mass.:
300.3705
SMILES:
CCCCNNC(=O)c1ccc(cc1)-c1cc(C)cc(F)c1
: