Target
Histone deacetylase 8
Ligand
BDBM468612
Substrate
Meas. Tech.
HDAC Inhibition
IC50
3600±n/a nM
Citation
 Liao, DRoush, WRStowe, RL HDAC inhibitor compounds and methods of treatment US Patent  US10807944 Publication Date 10/20/2020 
Target
Name:
Histone deacetylase 8
Synonyms:
HD8 HDAC8_HUMAN Histone deacetylase 8 (HDAC-8) | Human HDAC8
Type:
Enzyme
Mol. Mass.:
41749.60
Organism:
Homo sapiens (Human)
Description:
Q9BY41
Residue:
377
  
Inhibitor
Name:
BDBM468612
Synonyms:
US10807944, Compound SR-4372 | US11731934, Compound SR-4372
Type:
Small organic molecule
Emp. Form.:
C18H21FN2O
Mol. Mass.:
300.3705
SMILES:
CCCCNNC(=O)c1ccc(cc1)-c1cc(C)cc(F)c1
: