Target
Complement factor D
Ligand
BDBM468299
Substrate
Meas. Tech.
TBD
IC50
<1000±n/a nM
Citation
 Wiles, JAPhadke, ASDeshpande, MAgarwal, AChen, DGadhachanda, VRHashimoto, APais, GWang, QWang, XGreenlee, W Compounds for treatment of immune inflammatory disorders US Patent  US10807952 Publication Date 10/20/2020 
Target
Name:
Complement factor D
Synonyms:
Adipsin CFAD_HUMAN DF Properdin factor D
Type:
Protein
Mol. Mass.:
27039.19
Organism:
Homo sapiens (Human)
Description:
P00746
Residue:
253
  
Inhibitor
Name:
BDBM468299
Synonyms:
(2S,4R)-1-(2-(3- acetyl-1H- pyrazolo[3,4- e]pyridin-1- yl)acetyl)-N-(3-(4- chloro-1H- benzo[d]imidazol- 5-yl)-2- fluorophenyl)-4- fluoropyrrolidine-2- carboxamide | US10807952, Cmp No. 1
Type:
Small organic molecule
Emp. Form.:
C28H22ClF2N7O3
Mol. Mass.:
577.969
SMILES:
CC(=O)c1nn(CC(=O)N2C[C@H](F)C[C@H]2C(=O)Nc2cccc(c2F)-c2ccc3[nH]cnc3c2Cl)c2cnccc12
: