Target
Complement factor D
Ligand
BDBM468633
Substrate
Meas. Tech.
TBD
IC50
<1000±n/a nM
Citation
 Wiles, JAPhadke, ASDeshpande, MAgarwal, AChen, DGadhachanda, VRHashimoto, APais, GWang, QWang, XGreenlee, W Compounds for treatment of immune inflammatory disorders US Patent  US10807952 Publication Date 10/20/2020 
Target
Name:
Complement factor D
Synonyms:
Adipsin CFAD_HUMAN DF Properdin factor D
Type:
Protein
Mol. Mass.:
27039.19
Organism:
Homo sapiens (Human)
Description:
P00746
Residue:
253
  
Inhibitor
Name:
BDBM468633
Synonyms:
1-(2-((2S,4R)-4- fluoro-2-(2-fluoro- 3-(pyrazolo[1,5- a]pyrimidin-6- yl)phenylcarbamoyl) pyrrolidin-1-yl)-2- oxoethyl)-1H- indazole-3- carboxamide | US10807952, Cmp No. 37
Type:
Small organic molecule
Emp. Form.:
C27H22F2N8O3
Mol. Mass.:
544.5122
SMILES:
NC(=O)c1nn(CC(=O)N2C[C@H](F)C[C@H]2C(=O)Nc2cccc(c2F)-c2cnc3ccnn3c2)c2ccccc12
: