Target
Complement factor D
Ligand
BDBM468635
Substrate
Meas. Tech.
TBD
IC50
<1000±n/a nM
Citation
 Wiles, JAPhadke, ASDeshpande, MAgarwal, AChen, DGadhachanda, VRHashimoto, APais, GWang, QWang, XGreenlee, W Compounds for treatment of immune inflammatory disorders US Patent  US10807952 Publication Date 10/20/2020 
Target
Name:
Complement factor D
Synonyms:
Adipsin CFAD_HUMAN DF Properdin factor D
Type:
Protein
Mol. Mass.:
27039.19
Organism:
Homo sapiens (Human)
Description:
P00746
Residue:
253
  
Inhibitor
Name:
BDBM468635
Synonyms:
1-(2-((2S,4R)-2-(5'- carbamoyl-2'- chloro-2- fluorobiphenyl-3- ylcarbamoyl)-4- fluoropyrrolidin-1- yl)-2-oxoethyl)-5- (trifluoromethyl)- 1H-thieno[3,2- c]pyrazole-3- carboxamide | US10807952, Cmp No. 39
Type:
Small organic molecule
Emp. Form.:
C27H20ClF5N6O4S
Mol. Mass.:
654.996
SMILES:
NC(=O)c1nn(CC(=O)N2C[C@H](F)C[C@H]2C(=O)Nc2cccc(c2F)-c2cc(ccc2Cl)C(N)=O)c2cc(sc12)C(F)(F)F
: