Target
Complement factor D
Ligand
BDBM468638
Substrate
Meas. Tech.
TBD
IC50
<1000±n/a nM
Citation
 Wiles, JAPhadke, ASDeshpande, MAgarwal, AChen, DGadhachanda, VRHashimoto, APais, GWang, QWang, XGreenlee, W Compounds for treatment of immune inflammatory disorders US Patent  US10807952 Publication Date 10/20/2020 
Target
Name:
Complement factor D
Synonyms:
Adipsin CFAD_HUMAN DF Properdin factor D
Type:
Protein
Mol. Mass.:
27039.19
Organism:
Homo sapiens (Human)
Description:
P00746
Residue:
253
  
Inhibitor
Name:
BDBM468638
Synonyms:
(2S,4R)-N-(2'- chloro-2- fluorobiphenyl-3- yl)-1-(2-(3- chlorophenyl)acetyl)-4- fluoropyrrolidine-2- carboxamide | US10807952, Cmp No. 42
Type:
Small organic molecule
Emp. Form.:
C25H20Cl2F2N2O2
Mol. Mass.:
489.341
SMILES:
F[C@@H]1C[C@H](N(C1)C(=O)Cc1cccc(Cl)c1)C(=O)Nc1cccc(c1F)-c1ccccc1Cl
: