Target
Complement factor D
Ligand
BDBM468659
Substrate
Meas. Tech.
TBD
IC50
<1000±n/a nM
Citation
 Wiles, JAPhadke, ASDeshpande, MAgarwal, AChen, DGadhachanda, VRHashimoto, APais, GWang, QWang, XGreenlee, W Compounds for treatment of immune inflammatory disorders US Patent  US10807952 Publication Date 10/20/2020 
Target
Name:
Complement factor D
Synonyms:
Adipsin CFAD_HUMAN DF Properdin factor D
Type:
Protein
Mol. Mass.:
27039.19
Organism:
Homo sapiens (Human)
Description:
P00746
Residue:
253
  
Inhibitor
Name:
BDBM468659
Synonyms:
(2S,4R)-1-(2-(3- carbamoyl-5- methoxyphenyl) acetyl)-N-(2'-chloro-2- fluorobiphenyl-3- yl)-4- fluoropyrrolidine-2- carboxamide | US10807952, Cmp No. 63
Type:
Small organic molecule
Emp. Form.:
C27H24ClF2N3O4
Mol. Mass.:
527.947
SMILES:
COc1cc(CC(=O)N2C[C@H](F)C[C@H]2C(=O)Nc2cccc(c2F)-c2ccccc2Cl)cc(c1)C(N)=O
: