Target
Complement factor D
Ligand
BDBM468675
Substrate
Meas. Tech.
TBD
IC50
<1000±n/a nM
Citation
 Wiles, JAPhadke, ASDeshpande, MAgarwal, AChen, DGadhachanda, VRHashimoto, APais, GWang, QWang, XGreenlee, W Compounds for treatment of immune inflammatory disorders US Patent  US10807952 Publication Date 10/20/2020 
Target
Name:
Complement factor D
Synonyms:
Adipsin CFAD_HUMAN DF Properdin factor D
Type:
Protein
Mol. Mass.:
27039.19
Organism:
Homo sapiens (Human)
Description:
P00746
Residue:
253
  
Inhibitor
Name:
BDBM468675
Synonyms:
(2S,4R)-1-(2-(3- acetyl-1H-indazol- 1-yl)acetyl)-4- fluoro-N-(2-fluoro- 3-(2-oxo-1,2,3,4- tetrahydroquinolin-6- yl)phenyl)pyrrolidine- 2-carboxamide | US10807952, Cmp No. 82
Type:
Small organic molecule
Emp. Form.:
C31H27F2N5O4
Mol. Mass.:
571.574
SMILES:
CC(=O)c1nn(CC(=O)N2C[C@H](F)C[C@H]2C(=O)Nc2cccc(c2F)-c2ccc3NC(=O)CCc3c2)c2ccccc12
: