Target
Complement factor D
Ligand
BDBM468682
Substrate
Meas. Tech.
TBD
IC50
<1000±n/a nM
Citation
 Wiles, JAPhadke, ASDeshpande, MAgarwal, AChen, DGadhachanda, VRHashimoto, APais, GWang, QWang, XGreenlee, W Compounds for treatment of immune inflammatory disorders US Patent  US10807952 Publication Date 10/20/2020 
Target
Name:
Complement factor D
Synonyms:
Adipsin CFAD_HUMAN DF Properdin factor D
Type:
Protein
Mol. Mass.:
27039.19
Organism:
Homo sapiens (Human)
Description:
P00746
Residue:
253
  
Inhibitor
Name:
BDBM468682
Synonyms:
1-(2-((2S,4R)-2- ((2'-chloro-5'- (cyanocarbamoyl)- 2-fluoro-[1,1'- biphenyl]-3- yl)carbamoyl)-4- fluoropyrrolidin-1- yl)-2-oxoethyl)-1H- indazole-3- carboxamide | US10807952, Cmp No. 89
Type:
Small organic molecule
Emp. Form.:
C29H22ClF2N7O4
Mol. Mass.:
605.979
SMILES:
NC(=O)c1nn(CC(=O)N2C[C@H](F)C[C@H]2C(=O)Nc2cccc(c2F)-c2cc(ccc2Cl)C(=O)NC#N)c2ccccc12
: